{"text_format":"3","workbook":"xlsx","n_sheets":25,"sheets":["Список компаний","param","Жадваллар рўйхати","Список","1945_1_ru","1945_3_ru","Жадваллар","1806_1_uz","1806_2_uz","1806_3_uz","1806_4_uz","1806_5_uz","1806_6_uz","1882_1_uz","1882_2_uz","1882_3_uz","1882_4_uz","1882_5_uz","1945_1_uz","1945_2_uz","1945_3_uz","1945_4_uz","1945_5_uz","1945_6_uz","1945_7_uz"],"not_rendered":{"macros":1},"read":"whole","date_system":"1900"}

{"sheet":"Список компаний","index":0,"n_rows":42,"n_cols":6,"rows_kept":42,"hidden":true}
["---------------------"]
["\"Узбекинвест\" НКЭИС","0001",null,2021,{"$f":"\"31.03.\"&#REF!","v":{"$error":"#REF!"}},{"$f":"\"03\"","v":"03"}]
[" \"Узагросугурта\" АО","0002",null,2022,{"$f":"\"30.06.\"&#REF!","v":{"$error":"#REF!"}},{"$f":"\"06\"","v":"06"}]
["\"Кафолат\" АО","0003",null,2023,{"$f":"\"30.09.\"&#REF!","v":{"$error":"#REF!"}},{"$f":"\"09\"","v":"09"}]
["“Alfa Invest” ООО","0004",null,2024,{"$f":"\"31.12.\"&#REF!","v":{"$error":"#REF!"}},{"$f":"\"12\"","v":"12"}]
["“Alskom” АО","0005",null,2025]
{"$rows_left_out":37}
{"sheet":"param","index":1,"n_rows":29,"n_cols":2,"rows_kept":29,"hidden":true}
["1806_4_uz"]
[{"$f":"MAX('1806_4_uz'!B:B)","v":30},"max"]
[{"$f":"\"C\"&(A2+8)&\":F\"&(A2+8)","v":"C38:F38"},"delete_line"]
[{"$f":"\"B\"&(A2+8)","v":"B38"},"copy_line"]
[]
["1806_5_uz"]
{"$rows_left_out":24}
{"sheet":"Жадваллар рўйхати","index":2,"n_rows":42,"n_cols":6,"rows_kept":42,"hidden":true,"merged":[[0,0,1,17],[5,5,5,16],[7,5,7,16],[9,5,9,16],[11,5,11,16],[13,5,13,16],[15,5,15,16],[18,5,18,16],[20,5,20,16],[22,5,22,16],[24,5,24,16],[26,5,26,16],[28,4,28,16],[29,5,29,16],[31,5,31,16],[33,5,33,16],[35,5,35,16],[37,5,37,16],[39,5,39,16],[41,5,41,16]]}
["Жадваллар рўйхати"]
[]
[]
[]
[null,null,1806,null,"Суғурталовчилар ва қайта суғурталовчиларнинг тўлов қобилияти тўғрисидаги низом"]
[{"$nulls":4},"1806_1","Умумий суғурта соҳасида ёки фақат қайта суғурта қилиш фаолиятини амалга оширадиган суғурталовчининг тўлов қобилияти маржасининг етарлилиги нормативи ҳисоб-китоби"]
{"$rows_left_out":37}
{"sheet":"Список","index":3,"n_rows":19,"n_cols":5,"rows_kept":19,"hidden":true}
["Код приложения","Регистрационный номер документа","Наименование документа","Номер приложения","Наименование приложения"]
[{"$f":"B2&\"_\"&D2","v":"1806_1"},1806,"Положение о платежеспособности страховщиков и перестраховщиков",1,"Расчет норматива достаточности маржи платежеспособности страховщика, осуществляющего деятельность в отрасли общего страхования (исключительно по перестрахованию)"]
["1806_2",1806,"Положение о платежеспособности страховщиков и перестраховщиков",2,"Расчет норматива достаточности маржи платежеспособности страховщика, осуществляющего деятельность в отрасли страхования жизни"]
["1806_3",1806,"Положение о платежеспособности страховщиков и перестраховщиков",3,"Сведения о соблюдении требований по предельно допустимому размеру обязательств по отдельным рискам и совокупному размеру обязательств страховщика (перестраховщика) и размещению активов страховщика (перестраховщика)"]
["1806_4",1806,"Положение о платежеспособности страховщиков и перестраховщиков",4,"Расчет по долевому участию в уставном капитале любого одного юридического лица"]
["1806_5",1806,"Положение о платежеспособности страховщиков и перестраховщиков",5,"Расчет по сумме активов, размещенных у одного связанного лица или у всех связанных лиц страховщика/перестраховщика"]
{"$rows_left_out":14}
{"sheet":"1945_1_ru","index":4,"n_rows":146,"n_cols":8,"rows_kept":146,"merged":[[0,2,0,4],[1,2,1,4],[2,2,2,4],[3,2,3,4],[4,2,4,4],[6,1,6,3],[7,1,7,3],[8,1,8,3],[9,1,9,3],[10,1,10,3],[11,1,11,3],[12,1,12,3],[13,1,13,3],[14,1,14,3],[15,1,15,3],[16,1,16,3],[17,1,17,3],[18,1,18,3],[19,1,19,3],[20,1,20,3],[21,1,21,3],[22,1,22,3],[23,1,23,3],[24,1,24,3],[25,1,25,3],[26,1,26,3],[27,1,27,3],[28,1,28,3],[29,1,29,3],[30,1,30,3],[31,1,31,3],[32,1,32,3],[33,1,33,3],[34,1,34,3],[35,1,35,3],[36,1,36,3],[37,1,37,3],[38,1,38,3],[39,1,39,3],[40,1,40,3],[41,1,41,3],[42,1,42,3],[43,1,43,3],[44,1,44,3],[45,1,45,3],[46,1,46,3],[47,1,47,3],[48,1,48,3],[49,1,49,3],[50,1,50,3],[51,1,51,3],[52,1,52,3],[53,1,53,3],[54,1,54,3],[55,1,55,3],[56,1,56,3],[57,1,57,3],[58,1,58,3],[59,1,59,3],[60,1,60,3],[61,1,61,3],[62,1,62,3],[63,1,63,3],[64,1,64,3],[65,1,65,3],[66,1,66,3],[67,1,67,3],[68,1,68,3],[69,1,69,3],[70,1,70,3],[71,1,71,3],[72,1,72,3],[73,1,73,3],[74,1,74,3],[75,1,75,3],[76,1,76,3],[77,1,77,3],[78,1,78,3],[79,1,79,3],[80,1,80,3],[81,1,81,3],[82,1,82,3],[83,1,83,3],[84,1,84,3],[85,1,85,3],[86,1,86,3],[87,1,87,3],[88,1,88,3],[89,1,89,3],[90,1,90,3],[91,1,91,3],[92,1,92,3],[93,1,93,3],[94,1,94,3],[95,1,95,3],[96,1,96,3],[97,1,97,3],[98,1,98,3],[99,1,99,3],[100,1,100,3],[101,1,101,3],[102,1,102,3],[103,1,103,3],[104,1,104,3],[105,1,105,3],[106,1,106,3],[107,1,107,3],[108,1,108,3],[109,1,109,3],[110,1,110,3],[111,1,111,3],[112,1,112,3],[113,1,113,3],[114,1,114,3],[115,1,115,3],[116,1,116,3],[117,1,117,3],[118,1,118,3],[119,1,119,3],[120,1,120,3],[121,1,121,3],[122,1,122,3],[123,1,123,3],[124,1,124,3],[125,1,125,3],[126,1,126,3],[127,1,127,3],[128,1,128,3],[129,1,129,3],[130,1,130,3],[131,1,131,3],[132,1,132,3],[133,1,133,3],[134,1,134,3],[135,1,135,3],[136,1,136,3],[137,1,137,3],[138,1,138,3],[139,1,139,3],[140,1,140,3],[141,1,141,3],[142,1,142,3],[143,1,143,3],[145,1,147,6]]}
[null,"Рег. номер",{"$f":"VLOOKUP($C$5,Список!$A:$E,2,FALSE)","v":1945},null,null,"Список таблиц"]
[null,"Наим. док-та",{"$f":"VLOOKUP($C$5,Список!$A:$E,3,FALSE)","v":"Формы финансовой отчетности страховщиков и правила по их заполнению"}]
[null,"Номер прил-я",{"$f":"VLOOKUP($C$5,Список!$A:$E,4,FALSE)","v":1}]
[null,"Наим. прил-я",{"$f":"VLOOKUP($C$5,Список!$A:$E,5,FALSE)","v":"Бухгалтерский баланс — форма № 1 — страхование"}]
[null,"Код прил-я","1945_1"]
[]
{"$rows_left_out":141}
{"sheet":"1945_3_ru","index":5,"n_rows":49,"n_cols":9,"rows_kept":49,"merged":[[0,2,0,4],[1,2,1,4],[2,2,2,4],[3,2,3,4],[4,2,4,4],[6,1,7,3],[6,4,7,4],[6,5,6,6],[6,7,6,8],[8,1,8,3],[9,1,9,3],[10,1,10,3],[11,1,11,3],[12,1,12,3],[13,1,13,3],[14,1,14,3],[15,1,15,3],[16,1,16,3],[17,1,17,3],[18,1,18,3],[19,1,19,3],[20,1,20,3],[21,1,21,3],[22,1,22,3],[23,1,23,3],[24,1,24,3],[25,1,25,3],[26,1,26,3],[27,1,27,3],[28,1,28,3],[29,1,29,3],[30,1,30,3],[31,1,31,3],[32,1,32,3],[33,1,33,3],[34,1,34,3],[35,1,35,3],[36,1,36,3],[37,1,37,3],[38,1,38,3],[39,1,39,3],[40,1,40,3],[41,1,41,3],[42,1,42,3],[43,1,43,3],[44,1,44,3],[45,1,45,3],[46,1,46,3],[47,1,47,3],[48,1,48,3]]}
[null,"Рег. номер",{"$f":"VLOOKUP($C$5,Список!$A:$E,2,FALSE)","v":1945},null,null,"Список таблиц"]
[null,"Наим. док-та",{"$f":"VLOOKUP($C$5,Список!$A:$E,3,FALSE)","v":"Формы финансовой отчетности страховщиков и правила по их заполнению"}]
[null,"Номер прил-я",{"$f":"VLOOKUP($C$5,Список!$A:$E,4,FALSE)","v":3}]
[null,"Наим. прил-я",{"$f":"VLOOKUP($C$5,Список!$A:$E,5,FALSE)","v":"Отчет о финансовых результатах — форма № 2 — страхование"}]
[null,"Код прил-я","1945_3"]
[]
{"$rows_left_out":44}
{"sheet":"Жадваллар","index":6,"n_rows":19,"n_cols":5,"rows_kept":19,"hidden":true}
["Илова коди","Ҳужжат қайд рақами","Ҳужжат номи","Илова рақами","Илова номи"]
[{"$f":"B2&\"_\"&D2","v":"1806_1"},1806,"Суғурталовчилар ва қайта суғурталовчиларнинг тўлов қобилияти тўғрисидаги низом",1,"Умумий суғурта соҳасида ёки фақат қайта суғурта қилиш фаолиятини амалга оширадиган суғурталовчининг тўлов қобилияти маржасининг етарлилиги нормативи ҳисоб-китоби"]
["1806_2",1806,"Суғурталовчилар ва қайта суғурталовчиларнинг тўлов қобилияти тўғрисидаги низом",2,"Ҳаётни суғурта қилиш соҳасида суғурта фаолиятини амалга оширадиган суғурталовчининг тўлов қобилияти маржасининг етарлилиги нормативи ҳисоб-китоби"]
["1806_3",1806,"Суғурталовчилар ва қайта суғурталовчиларнинг тўлов қобилияти тўғрисидаги низом",3,"Суғурталовчи/қайта суғурталовчининг алоҳида таваккалчиликлар бўйича мажбуриятларнинг йўл қўйиладиган энг кўп миқдори ва мажбуриятлар жамининг йўл қўйиладиган энг кўп миқдори нормативларига риоя қилганлиги ҳамда суғурталовчи (қайта суғурталовчи) активларини жойлаштиришга оид талабларга риоя қилинганлиги тўғрисида маълумотлар"]
["1806_4",1806,"Суғурталовчилар ва қайта суғурталовчиларнинг тўлов қобилияти тўғрисидаги низом",4,"Суғурталовчи/қайта суғурталовчининг ҳар қандай битта юридик шахснинг устав капиталида иштирок этиш улуши ҳисоб-китоби"]
["1806_5",1806,"Суғурталовчилар ва қайта суғурталовчиларнинг тўлов қобилияти тўғрисидаги низом",5,"Суғурталовчи/қайта суғурталовчининг битта боғлиқ шахс ёки барча боғлиқ шахсларда жойлаштирилган активлари суммаси ҳисоб-китоби"]
{"$rows_left_out":14}
{"sheet":"1806_1_uz","index":7,"n_rows":35,"n_cols":4,"rows_kept":35,"hidden":true}
[null,"Қайд рақами",{"$f":"VLOOKUP($C$5,Жадваллар!$A:$E,2,FALSE)","v":1806},"Жадваллар рўйхати"]
[null,"Ҳужжат номи",{"$f":"VLOOKUP($C$5,Жадваллар!$A:$E,3,FALSE)","v":"Суғурталовчилар ва қайта суғурталовчиларнинг тўлов қобилияти тўғрисидаги низом"}]
[null,"Илова рақами",{"$f":"VLOOKUP($C$5,Жадваллар!$A:$E,4,FALSE)","v":1}]
[null,"Илова номи",{"$f":"VLOOKUP($C$5,Жадваллар!$A:$E,5,FALSE)","v":"Умумий суғурта соҳасида ёки фақат қайта суғурта қилиш фаолиятини амалга оширадиган суғурталовчининг тўлов қобилияти маржасининг етарлилиги нормативи ҳисоб-китоби"}]
[null,"Илова коди","1806_1"]
[]
{"$rows_left_out":30}
{"sheet":"1806_2_uz","index":8,"n_rows":39,"n_cols":4,"rows_kept":39,"hidden":true,"merged":[[38,1,39,3]]}
[null,"Қайд рақами",{"$f":"VLOOKUP($C$5,Жадваллар!$A:$E,2,FALSE)","v":1806},"Жадваллар рўйхати"]
[null,"Ҳужжат номи",{"$f":"VLOOKUP($C$5,Жадваллар!$A:$E,3,FALSE)","v":"Суғурталовчилар ва қайта суғурталовчиларнинг тўлов қобилияти тўғрисидаги низом"}]
[null,"Илова рақами",{"$f":"VLOOKUP($C$5,Жадваллар!$A:$E,4,FALSE)","v":2}]
[null,"Илова номи",{"$f":"VLOOKUP($C$5,Жадваллар!$A:$E,5,FALSE)","v":"Ҳаётни суғурта қилиш соҳасида суғурта фаолиятини амалга оширадиган суғурталовчининг тўлов қобилияти маржасининг етарлилиги нормативи ҳисоб-китоби"}]
[null,"Илова коди","1806_2"]
[]
{"$rows_left_out":34}
{"sheet":"1806_3_uz","index":9,"n_rows":20,"n_cols":5,"rows_kept":20,"hidden":true,"merged":[[6,3,6,4]]}
[null,"Қайд рақами",{"$f":"VLOOKUP($C$5,Жадваллар!$A:$E,2,FALSE)","v":1806},"Жадваллар рўйхати"]
[null,"Ҳужжат номи",{"$f":"VLOOKUP($C$5,Жадваллар!$A:$E,3,FALSE)","v":"Суғурталовчилар ва қайта суғурталовчиларнинг тўлов қобилияти тўғрисидаги низом"}]
[null,"Илова рақами",{"$f":"VLOOKUP($C$5,Жадваллар!$A:$E,4,FALSE)","v":3}]
[null,"Илова номи",{"$f":"VLOOKUP($C$5,Жадваллар!$A:$E,5,FALSE)","v":"Суғурталовчи/қайта суғурталовчининг алоҳида таваккалчиликлар бўйича мажбуриятларнинг йўл қўйиладиган энг кўп миқдори ва мажбуриятлар жамининг йўл қўйиладиган энг кўп миқдори нормативларига риоя қилганлиги ҳамда суғурталовчи (қайта суғурталовчи) активларини жойлаштиришга оид талабларга риоя қилинганлиги тўғрисида маълумотлар"}]
[null,"Илова коди","1806_3"]
[]
{"$rows_left_out":15}
{"sheet":"1806_4_uz","index":10,"n_rows":37,"n_cols":6,"rows_kept":37,"hidden":true}
[null,"Қайд рақами",{"$f":"VLOOKUP($C$5,Жадваллар!$A:$E,2,FALSE)","v":1806},"Жадваллар рўйхати"]
[null,"Ҳужжат номи",{"$f":"VLOOKUP($C$5,Жадваллар!$A:$E,3,FALSE)","v":"Суғурталовчилар ва қайта суғурталовчиларнинг тўлов қобилияти тўғрисидаги низом"}]
[null,"Илова рақами",{"$f":"VLOOKUP($C$5,Жадваллар!$A:$E,4,FALSE)","v":4}]
[null,"Илова номи",{"$f":"VLOOKUP($C$5,Жадваллар!$A:$E,5,FALSE)","v":"Суғурталовчи/қайта суғурталовчининг ҳар қандай битта юридик шахснинг устав капиталида иштирок этиш улуши ҳисоб-китоби"}]
[null,"Илова коди","1806_4"]
[]
{"$rows_left_out":32}
{"sheet":"1806_5_uz","index":11,"n_rows":37,"n_cols":8,"rows_kept":37,"hidden":true}
[null,"Қайд рақами",{"$f":"VLOOKUP($C$5,Жадваллар!$A:$E,2,FALSE)","v":1806},"Жадваллар рўйхати"]
[null,"Ҳужжат номи",{"$f":"VLOOKUP($C$5,Жадваллар!$A:$E,3,FALSE)","v":"Суғурталовчилар ва қайта суғурталовчиларнинг тўлов қобилияти тўғрисидаги низом"}]
[null,"Илова рақами",{"$f":"VLOOKUP($C$5,Жадваллар!$A:$E,4,FALSE)","v":5}]
[null,"Илова номи",{"$f":"VLOOKUP($C$5,Жадваллар!$A:$E,5,FALSE)","v":"Суғурталовчи/қайта суғурталовчининг битта боғлиқ шахс ёки барча боғлиқ шахсларда жойлаштирилган активлари суммаси ҳисоб-китоби"}]
[null,"Илова коди","1806_5"]
[]
{"$rows_left_out":32}
{"sheet":"1806_6_uz","index":12,"n_rows":44,"n_cols":8,"rows_kept":44,"hidden":true,"merged":[[12,1,12,7]]}
[null,"Қайд рақами",{"$f":"VLOOKUP($C$5,Жадваллар!$A:$E,2,FALSE)","v":1806},"Жадваллар рўйхати"]
[null,"Ҳужжат номи",{"$f":"VLOOKUP($C$5,Жадваллар!$A:$E,3,FALSE)","v":"Суғурталовчилар ва қайта суғурталовчиларнинг тўлов қобилияти тўғрисидаги низом"}]
[null,"Илова рақами",{"$f":"VLOOKUP($C$5,Жадваллар!$A:$E,4,FALSE)","v":6}]
[null,"Илова номи",{"$f":"VLOOKUP($C$5,Жадваллар!$A:$E,5,FALSE)","v":"Суғурталовчи/қайта суғурталовчининг қайта суғурта қилиш операцияларига оид талабларга риоя қилганлиги тўғрисида маълумотлар"}]
[null,"Илова коди","1806_6"]
[]
{"$rows_left_out":39}
{"sheet":"1882_1_uz","index":13,"n_rows":34,"n_cols":4,"rows_kept":34,"hidden":true,"merged":[[33,1,35,3]]}
[null,"Қайд рақами",{"$f":"VLOOKUP($C$5,Жадваллар!$A:$E,2,FALSE)","v":1882},"Жадваллар рўйхати"]
[null,"Ҳужжат номи",{"$f":"VLOOKUP($C$5,Жадваллар!$A:$E,3,FALSE)","v":"Суғурталовчиларнинг суғурта захиралари тўғрисидаги низом"}]
[null,"Илова рақами",{"$f":"VLOOKUP($C$5,Жадваллар!$A:$E,4,FALSE)","v":1}]
[null,"Илова номи",{"$f":"VLOOKUP($C$5,Жадваллар!$A:$E,5,FALSE)","v":"Транспорт воситалари эгаларининг фуқаролик жавобгарлигини мажбурий суғурта қилиш бўйича барқарорлаштириш захирасини ҳисоблаш мақсадида даромадлар, харажатлар ва молиявий натижаларнинг ҳисоб-китоби"}]
[null,"Илова коди","1882_1"]
[{"$nulls":3},"1-жадвал"]
{"$rows_left_out":29}
{"sheet":"1882_2_uz","index":14,"n_rows":32,"n_cols":4,"rows_kept":32,"hidden":true,"merged":[[31,1,33,3]]}
[null,"Қайд рақами",{"$f":"VLOOKUP($C$5,Жадваллар!$A:$E,2,FALSE)","v":1882},"Жадваллар рўйхати"]
[null,"Ҳужжат номи",{"$f":"VLOOKUP($C$5,Жадваллар!$A:$E,3,FALSE)","v":"Суғурталовчиларнинг суғурта захиралари тўғрисидаги низом"}]
[null,"Илова рақами",{"$f":"VLOOKUP($C$5,Жадваллар!$A:$E,4,FALSE)","v":2}]
[null,"Илова номи",{"$f":"VLOOKUP($C$5,Жадваллар!$A:$E,5,FALSE)","v":"Иш берувчининг фуқаролик жавобгарлигини мажбурий суғурта қилиш бўйича барқарорлаштириш захирасини ҳисоблаш мақсадида даромадлар, харажатлар ва молиявий натижаларнинг ҳисоб-китоби"}]
[null,"Илова коди","1882_2"]
[{"$nulls":3},"1-жадвал"]
{"$rows_left_out":27}
{"sheet":"1882_3_uz","index":15,"n_rows":32,"n_cols":4,"rows_kept":32,"hidden":true,"merged":[[31,1,33,3]]}
[null,"Қайд рақами",{"$f":"VLOOKUP($C$5,Жадваллар!$A:$E,2,FALSE)","v":1882},"Жадваллар рўйхати"]
[null,"Ҳужжат номи",{"$f":"VLOOKUP($C$5,Жадваллар!$A:$E,3,FALSE)","v":"Суғурталовчиларнинг суғурта захиралари тўғрисидаги низом"}]
[null,"Илова рақами",{"$f":"VLOOKUP($C$5,Жадваллар!$A:$E,4,FALSE)","v":3}]
[null,"Илова номи",{"$f":"VLOOKUP($C$5,Жадваллар!$A:$E,5,FALSE)","v":"Ташувчининг фуқаролик жавобгарлигини мажбурий суғурта қилиш бўйича барқарорлаштириш захирасини ҳисоблаш мақсадида даромадлар, харажатлар ва молиявий натижаларнинг ҳисоб-китоби"}]
[null,"Илова коди","1882_3"]
[{"$nulls":3},"1-жадвал"]
{"$rows_left_out":27}
{"sheet":"1882_4_uz","index":16,"n_rows":47,"n_cols":8,"rows_kept":47,"hidden":true,"merged":[[6,1,7,2],[6,3,7,3],[6,4,6,7],[8,1,8,2],[9,1,9,2],[10,1,10,2],[11,1,11,2],[12,1,12,2],[13,1,13,2],[14,1,14,2],[15,1,15,2],[16,1,16,2],[17,1,17,2],[18,1,18,2],[19,1,19,2],[20,1,20,2],[21,1,21,2],[22,1,22,2],[23,1,23,2],[24,1,24,2],[25,1,25,2],[26,1,26,2],[27,1,27,2],[28,1,28,2],[29,1,29,2],[30,1,30,2],[31,1,31,2],[32,1,32,2],[33,1,33,2],[34,1,34,2],[35,1,35,2],[36,1,36,2],[37,1,37,2],[38,1,38,2],[39,1,39,2],[40,1,40,2],[41,1,41,2],[42,1,42,2],[43,1,43,2],[44,1,44,2],[45,1,45,2],[46,1,46,2]]}
[null,"Қайд рақами",{"$f":"VLOOKUP($C$5,Жадваллар!$A:$E,2,FALSE)","v":1882},"Жадваллар рўйхати"]
[null,"Ҳужжат номи",{"$f":"VLOOKUP($C$5,Жадваллар!$A:$E,3,FALSE)","v":"Суғурталовчиларнинг суғурта захиралари тўғрисидаги низом"}]
[null,"Илова рақами",{"$f":"VLOOKUP($C$5,Жадваллар!$A:$E,4,FALSE)","v":4}]
[null,"Илова номи",{"$f":"VLOOKUP($C$5,Жадваллар!$A:$E,5,FALSE)","v":"Суғурта захираларининг умумий миқдори"}]
[null,"Илова коди","1882_4"]
[]
{"$rows_left_out":42}
{"sheet":"1882_5_uz","index":17,"n_rows":45,"n_cols":8,"rows_kept":45,"hidden":true,"merged":[[6,1,7,2],[6,3,6,4],[6,5,6,7],[8,1,8,2],[9,1,9,2],[10,1,10,2],[11,1,11,2],[12,1,12,2],[13,1,13,2],[14,1,14,2],[15,1,15,2],[16,1,16,2],[17,1,17,2],[18,1,18,2],[19,1,19,2],[20,1,20,2],[21,1,21,2],[22,1,22,2],[23,1,23,2],[24,1,24,2],[25,1,25,2],[26,1,26,2],[27,1,27,2],[28,1,28,2],[29,1,29,2],[30,1,30,2],[31,1,31,2],[32,1,32,2],[33,1,33,2],[34,1,34,2],[35,1,35,2],[36,1,36,2],[37,1,37,2],[38,1,38,2],[39,1,39,2],[40,1,40,2],[41,1,41,2],[42,1,42,2],[43,1,43,2],[44,1,44,2]]}
[null,"Қайд рақами",{"$f":"VLOOKUP($C$5,Жадваллар!$A:$E,2,FALSE)","v":1882},"Жадваллар рўйхати"]
[null,"Ҳужжат номи",{"$f":"VLOOKUP($C$5,Жадваллар!$A:$E,3,FALSE)","v":"Суғурталовчиларнинг суғурта захиралари тўғрисидаги низом"}]
[null,"Илова рақами",{"$f":"VLOOKUP($C$5,Жадваллар!$A:$E,4,FALSE)","v":5}]
[null,"Илова номи",{"$f":"VLOOKUP($C$5,Жадваллар!$A:$E,5,FALSE)","v":"Активлар таркиби тўғрисида маълумот"}]
[null,"Илова коди","1882_5"]
[]
{"$rows_left_out":40}
{"sheet":"1945_1_uz","index":18,"n_rows":146,"n_cols":8,"rows_kept":146,"hidden":true,"merged":[[0,2,0,6],[1,2,1,6],[2,2,2,6],[3,2,3,6],[4,2,4,6],[6,1,6,3],[7,1,7,3],[8,1,8,3],[9,1,9,3],[10,1,10,3],[11,1,11,3],[12,1,12,3],[13,1,13,3],[14,1,14,3],[15,1,15,3],[16,1,16,3],[17,1,17,3],[18,1,18,3],[19,1,19,3],[20,1,20,3],[21,1,21,3],[22,1,22,3],[23,1,23,3],[24,1,24,3],[25,1,25,3],[26,1,26,3],[27,1,27,3],[28,1,28,3],[29,1,29,3],[30,1,30,3],[31,1,31,3],[32,1,32,3],[33,1,33,3],[34,1,34,3],[35,1,35,3],[36,1,36,3],[37,1,37,3],[38,1,38,3],[39,1,39,3],[40,1,40,3],[41,1,41,3],[42,1,42,3],[43,1,43,3],[44,1,44,3],[45,1,45,3],[46,1,46,3],[47,1,47,3],[48,1,48,3],[49,1,49,3],[50,1,50,3],[51,1,51,3],[52,1,52,3],[53,1,53,3],[54,1,54,3],[55,1,55,3],[56,1,56,3],[57,1,57,3],[58,1,58,3],[59,1,59,3],[60,1,60,3],[61,1,61,3],[62,1,62,3],[63,1,63,3],[64,1,64,3],[65,1,65,3],[66,1,66,3],[67,1,67,3],[68,1,68,3],[69,1,69,3],[70,1,70,3],[71,1,71,3],[72,1,72,3],[73,1,73,3],[74,1,74,3],[75,1,75,3],[76,1,76,3],[77,1,77,3],[78,1,78,3],[79,1,79,3],[80,1,80,3],[81,1,81,3],[82,1,82,3],[83,1,83,3],[84,1,84,3],[85,1,85,3],[86,1,86,3],[87,1,87,3],[88,1,88,3],[89,1,89,3],[90,1,90,3],[91,1,91,3],[92,1,92,3],[93,1,93,3],[94,1,94,3],[95,1,95,3],[96,1,96,3],[97,1,97,3],[98,1,98,3],[99,1,99,3],[100,1,100,3],[101,1,101,3],[102,1,102,3],[103,1,103,3],[104,1,104,3],[105,1,105,3],[106,1,106,3],[107,1,107,3],[108,1,108,3],[109,1,109,3],[110,1,110,3],[111,1,111,3],[112,1,112,3],[113,1,113,3],[114,1,114,3],[115,1,115,3],[116,1,116,3],[117,1,117,3],[118,1,118,3],[119,1,119,3],[120,1,120,3],[121,1,121,3],[122,1,122,3],[123,1,123,3],[124,1,124,3],[125,1,125,3],[126,1,126,3],[127,1,127,3],[128,1,128,3],[129,1,129,3],[130,1,130,3],[131,1,131,3],[132,1,132,3],[133,1,133,3],[134,1,134,3],[135,1,135,3],[136,1,136,3],[137,1,137,3],[138,1,138,3],[139,1,139,3],[140,1,140,3],[141,1,141,3],[142,1,142,3],[143,1,143,3],[145,1,147,6]]}
[null,"Қайд рақами",{"$f":"VLOOKUP($C$5,Жадваллар!$A:$E,2,FALSE)","v":1945},{"$nulls":4},"Жадваллар рўйхати"]
[null,"Ҳужжат номи",{"$f":"VLOOKUP($C$5,Жадваллар!$A:$E,3,FALSE)","v":"Суғурталовчиларнинг молиявий ҳисобот шаклларини ва уларни тўлдириш бўйича қоидаларни тасдиқлаш тўғрисидаги Молия вазирлиги буйруғи"}]
[null,"Илова рақами",{"$f":"VLOOKUP($C$5,Жадваллар!$A:$E,4,FALSE)","v":1}]
[null,"Илова номи",{"$f":"VLOOKUP($C$5,Жадваллар!$A:$E,5,FALSE)","v":"Бухгалтерия баланси — 1-сонли шакл — суғурта"}]
[null,"Илова коди","1945_1"]
[]
{"$rows_left_out":141}
{"sheet":"1945_2_uz","index":19,"n_rows":23,"n_cols":7,"rows_kept":23,"hidden":true,"merged":[[0,2,0,4],[1,2,1,4],[2,2,2,4],[3,2,3,4],[4,2,4,4],[6,1,6,3],[7,1,7,3],[8,1,8,3],[9,1,9,3],[10,1,10,3],[11,1,11,3],[12,1,12,3],[13,1,13,3],[14,1,14,3],[15,1,15,3],[16,1,16,3],[17,1,17,3],[18,1,18,3],[19,1,19,3],[20,1,20,3],[22,1,24,6]]}
[null,"Қайд рақами",{"$f":"VLOOKUP($C$5,Жадваллар!$A:$E,2,FALSE)","v":1945},null,null,"Жадваллар рўйхати"]
[null,"Ҳужжат номи",{"$f":"VLOOKUP($C$5,Жадваллар!$A:$E,3,FALSE)","v":"Суғурталовчиларнинг молиявий ҳисобот шаклларини ва уларни тўлдириш бўйича қоидаларни тасдиқлаш тўғрисидаги Молия вазирлиги буйруғи"}]
[null,"Илова рақами",{"$f":"VLOOKUP($C$5,Жадваллар!$A:$E,4,FALSE)","v":2}]
[null,"Илова номи",{"$f":"VLOOKUP($C$5,Жадваллар!$A:$E,5,FALSE)","v":"Балансдан ташқари счётларда ҳисобга олинадиган қийматликларнинг мавжудлиги тўғрисида маълумотнома"}]
[null,"Илова коди","1945_2"]
[]
{"$rows_left_out":18}
{"sheet":"1945_3_uz","index":20,"n_rows":49,"n_cols":9,"rows_kept":49,"hidden":true,"merged":[[0,2,0,6],[1,2,1,6],[2,2,2,6],[3,2,3,6],[4,2,4,6],[6,1,7,3],[6,4,7,4],[6,5,6,6],[6,7,6,8],[8,1,8,3],[9,1,9,3],[10,1,10,3],[11,1,11,3],[12,1,12,3],[13,1,13,3],[14,1,14,3],[15,1,15,3],[16,1,16,3],[17,1,17,3],[18,1,18,3],[19,1,19,3],[20,1,20,3],[21,1,21,3],[22,1,22,3],[23,1,23,3],[24,1,24,3],[25,1,25,3],[26,1,26,3],[27,1,27,3],[28,1,28,3],[29,1,29,3],[30,1,30,3],[31,1,31,3],[32,1,32,3],[33,1,33,3],[34,1,34,3],[35,1,35,3],[36,1,36,3],[37,1,37,3],[38,1,38,3],[39,1,39,3],[40,1,40,3],[41,1,41,3],[42,1,42,3],[43,1,43,3],[44,1,44,3],[45,1,45,3],[46,1,46,3],[47,1,47,3],[48,1,48,3]]}
[null,"Қайд рақами",{"$f":"VLOOKUP($C$5,Жадваллар!$A:$E,2,FALSE)","v":1945},{"$nulls":4},"Жадваллар рўйхати"]
[null,"Ҳужжат номи",{"$f":"VLOOKUP($C$5,Жадваллар!$A:$E,3,FALSE)","v":"Суғурталовчиларнинг молиявий ҳисобот шаклларини ва уларни тўлдириш бўйича қоидаларни тасдиқлаш тўғрисидаги Молия вазирлиги буйруғи"}]
[null,"Илова рақами",{"$f":"VLOOKUP($C$5,Жадваллар!$A:$E,4,FALSE)","v":3}]
[null,"Илова номи",{"$f":"VLOOKUP($C$5,Жадваллар!$A:$E,5,FALSE)","v":"Молиявий натижалар тўғрисидаги ҳисобот — 2-сонли шакл — суғурта"}]
[null,"Илова коди","1945_3"]
[]
{"$rows_left_out":44}
{"sheet":"1945_4_uz","index":21,"n_rows":26,"n_cols":7,"rows_kept":26,"hidden":true,"merged":[[0,2,0,4],[1,2,1,4],[2,2,2,4],[3,2,3,4],[4,2,4,4],[6,1,6,3],[7,1,7,3],[8,1,8,3],[9,1,9,3],[10,1,10,3],[11,1,11,3],[12,1,12,3],[13,1,13,3],[14,1,14,3],[15,1,15,3],[16,1,16,3],[17,1,17,3],[18,1,18,3],[19,1,19,3],[20,1,20,3],[21,1,21,3],[22,1,22,3],[23,1,23,3],[24,1,24,3],[25,1,25,3]]}
[null,"Қайд рақами",{"$f":"VLOOKUP($C$5,Жадваллар!$A:$E,2,FALSE)","v":1945},null,null,"Жадваллар рўйхати"]
[null,"Ҳужжат номи",{"$f":"VLOOKUP($C$5,Жадваллар!$A:$E,3,FALSE)","v":"Суғурталовчиларнинг молиявий ҳисобот шаклларини ва уларни тўлдириш бўйича қоидаларни тасдиқлаш тўғрисидаги Молия вазирлиги буйруғи"}]
[null,"Илова рақами",{"$f":"VLOOKUP($C$5,Жадваллар!$A:$E,4,FALSE)","v":4}]
[null,"Илова номи",{"$f":"VLOOKUP($C$5,Жадваллар!$A:$E,5,FALSE)","v":"Бюджетга тўловлар тўғрисида маълумотнома"}]
[null,"Илова коди","1945_4"]
[]
{"$rows_left_out":21}
{"sheet":"1945_5_uz","index":22,"n_rows":47,"n_cols":7,"rows_kept":47,"hidden":true,"merged":[[0,2,0,4],[1,2,1,4],[2,2,2,4],[3,2,3,4],[4,2,4,4],[6,1,6,3],[7,1,7,3],[8,1,8,3],[9,1,9,3],[10,1,10,3],[11,1,11,3],[12,1,12,3],[13,1,13,3],[14,1,14,3],[15,1,15,3],[16,1,16,3],[17,1,17,3],[18,1,18,3],[19,1,19,3],[20,1,20,3],[21,1,21,3],[22,1,22,3],[23,1,23,3],[24,1,24,3],[25,1,25,3],[26,1,26,3],[27,1,27,3],[28,1,28,3],[29,1,29,3],[30,1,30,3],[31,1,31,3],[32,1,32,3],[33,1,33,3],[34,1,34,3],[35,1,35,3],[36,1,36,3],[37,1,37,3],[38,1,38,3],[39,1,39,3],[40,1,40,3],[41,1,41,3],[42,1,42,3],[43,1,43,3],[44,1,44,3],[45,1,45,3],[46,1,46,3]]}
[null,"Қайд рақами",{"$f":"VLOOKUP($C$5,Жадваллар!$A:$E,2,FALSE)","v":1945},null,null,"Жадваллар рўйхати"]
[null,"Ҳужжат номи",{"$f":"VLOOKUP($C$5,Жадваллар!$A:$E,3,FALSE)","v":"Суғурталовчиларнинг молиявий ҳисобот шаклларини ва уларни тўлдириш бўйича қоидаларни тасдиқлаш тўғрисидаги Молия вазирлиги буйруғи"}]
[null,"Илова рақами",{"$f":"VLOOKUP($C$5,Жадваллар!$A:$E,4,FALSE)","v":5}]
[null,"Илова номи",{"$f":"VLOOKUP($C$5,Жадваллар!$A:$E,5,FALSE)","v":"Пул оқимлари тўғрисидаги ҳисобот — 4-сонли шакл — суғурта"}]
[null,"Илова коди","1945_5"]
[]
{"$rows_left_out":42}
{"sheet":"1945_6_uz","index":23,"n_rows":19,"n_cols":6,"rows_kept":19,"hidden":true,"merged":[[0,2,0,4],[1,2,1,4],[2,2,2,4],[3,2,3,4],[4,2,4,4],[6,1,6,3],[7,1,7,3],[8,1,8,3],[9,1,9,3],[10,1,10,3],[11,1,11,3],[12,1,12,3],[13,1,13,3],[14,1,14,3],[15,1,15,3],[16,1,16,3],[17,1,17,3],[18,1,18,3]]}
[null,"Қайд рақами",{"$f":"VLOOKUP($C$5,Жадваллар!$A:$E,2,FALSE)","v":1945},null,null,"Жадваллар рўйхати"]
[null,"Ҳужжат номи",{"$f":"VLOOKUP($C$5,Жадваллар!$A:$E,3,FALSE)","v":"Суғурталовчиларнинг молиявий ҳисобот шаклларини ва уларни тўлдириш бўйича қоидаларни тасдиқлаш тўғрисидаги Молия вазирлиги буйруғи"}]
[null,"Илова рақами",{"$f":"VLOOKUP($C$5,Жадваллар!$A:$E,4,FALSE)","v":6}]
[null,"Илова номи",{"$f":"VLOOKUP($C$5,Жадваллар!$A:$E,5,FALSE)","v":"Чет эл валютасидаги пул маблағларининг ҳаракати тўғрисида маълумотнома"}]
[null,"Илова коди","1945_6"]
[]
{"$rows_left_out":14}
{"sheet":"1945_7_uz","index":24,"n_rows":29,"n_cols":12,"rows_kept":29,"hidden":true,"merged":[[0,2,0,6],[1,2,1,6],[2,2,2,6],[3,2,3,6],[4,2,4,6],[6,1,6,3],[7,1,7,3],[8,1,8,3],[9,1,9,3],[10,1,10,3],[11,1,11,3],[12,1,12,3],[13,1,13,3],[14,1,14,3],[15,1,15,3],[16,1,16,3],[17,1,17,3],[18,1,18,3],[19,1,19,3],[20,1,20,3],[21,1,21,3],[22,1,22,3],[23,1,23,3],[24,1,24,3],[25,1,25,3],[26,1,26,3],[27,1,27,3],[28,1,28,3]]}
[null,"Қайд рақами",{"$f":"VLOOKUP($C$5,Жадваллар!$A:$E,2,FALSE)","v":1945},{"$nulls":4},"Жадваллар рўйхати"]
[null,"Ҳужжат номи",{"$f":"VLOOKUP($C$5,Жадваллар!$A:$E,3,FALSE)","v":"Суғурталовчиларнинг молиявий ҳисобот шаклларини ва уларни тўлдириш бўйича қоидаларни тасдиқлаш тўғрисидаги Молия вазирлиги буйруғи"}]
[null,"Илова рақами",{"$f":"VLOOKUP($C$5,Жадваллар!$A:$E,4,FALSE)","v":7}]
[null,"Илова номи",{"$f":"VLOOKUP($C$5,Жадваллар!$A:$E,5,FALSE)","v":"Хусусий капитал тўғрисидаги ҳисобот — 5-сонли шакл — суғурта"}]
[null,"Илова коди","1945_7"]
[]
{"$rows_left_out":23}